Alluxio Integration - FUSE Tests failing, attaching logs.

Description

[INFO] — maven-surefire-plugin:2.19.1:test (default-test) @ alluxio-integration-fuse —

-------------------------------------------------------
T E S T S
-------------------------------------------------------
Java HotSpot(TM) 64-Bit Server VM warning: ignoring option MaxPermSize=512M; support was removed in 8.0
Running alluxio.fuse.AlluxioFuseFileSystemTest
Tests run: 13, Failures: 0, Errors: 13, Skipped: 0, Time elapsed: 0.582 sec <<< FAILURE! - in alluxio.fuse.AlluxioFuseFileSystemTest
create(alluxio.fuse.AlluxioFuseFileSystemTest) Time elapsed: 0.419 sec <<< ERROR!
java.lang.UnsatisfiedLinkError: dlopen(libfuse.dylib, 9): image not found
at alluxio.fuse.AlluxioFuseFileSystemTest.before(AlluxioFuseFileSystemTest.java:75)

rename(alluxio.fuse.AlluxioFuseFileSystemTest) Time elapsed: 0.005 sec <<< ERROR!
java.lang.UnsatisfiedLinkError: dlopen(libfuse.dylib, 9): image not found
at alluxio.fuse.AlluxioFuseFileSystemTest.before(AlluxioFuseFileSystemTest.java:75)

getattr(alluxio.fuse.AlluxioFuseFileSystemTest) Time elapsed: 0.005 sec <<< ERROR!
java.lang.UnsatisfiedLinkError: dlopen(libfuse.dylib, 9): image not found
at alluxio.fuse.AlluxioFuseFileSystemTest.before(AlluxioFuseFileSystemTest.java:75)

renameOldNotExist(alluxio.fuse.AlluxioFuseFileSystemTest) Time elapsed: 0.006 sec <<< ERROR!
java.lang.UnsatisfiedLinkError: dlopen(libfuse.dylib, 9): image not found
at alluxio.fuse.AlluxioFuseFileSystemTest.before(AlluxioFuseFileSystemTest.java:75)

open(alluxio.fuse.AlluxioFuseFileSystemTest) Time elapsed: 0.005 sec <<< ERROR!
java.lang.UnsatisfiedLinkError: dlopen(libfuse.dylib, 9): image not found
at alluxio.fuse.AlluxioFuseFileSystemTest.before(AlluxioFuseFileSystemTest.java:75)

read(alluxio.fuse.AlluxioFuseFileSystemTest) Time elapsed: 0.003 sec <<< ERROR!
java.lang.UnsatisfiedLinkError: dlopen(libfuse.dylib, 9): image not found
at alluxio.fuse.AlluxioFuseFileSystemTest.before(AlluxioFuseFileSystemTest.java:75)

chmod(alluxio.fuse.AlluxioFuseFileSystemTest) Time elapsed: 0.004 sec <<< ERROR!
java.lang.UnsatisfiedLinkError: dlopen(libfuse.dylib, 9): image not found
at alluxio.fuse.AlluxioFuseFileSystemTest.before(AlluxioFuseFileSystemTest.java:75)

chown(alluxio.fuse.AlluxioFuseFileSystemTest) Time elapsed: 0.007 sec <<< ERROR!
java.lang.UnsatisfiedLinkError: dlopen(libfuse.dylib, 9): image not found
at alluxio.fuse.AlluxioFuseFileSystemTest.before(AlluxioFuseFileSystemTest.java:75)

flush(alluxio.fuse.AlluxioFuseFileSystemTest) Time elapsed: 0.003 sec <<< ERROR!
java.lang.UnsatisfiedLinkError: dlopen(libfuse.dylib, 9): image not found
at alluxio.fuse.AlluxioFuseFileSystemTest.before(AlluxioFuseFileSystemTest.java:75)

mkDir(alluxio.fuse.AlluxioFuseFileSystemTest) Time elapsed: 0.004 sec <<< ERROR!
java.lang.UnsatisfiedLinkError: dlopen(libfuse.dylib, 9): image not found
at alluxio.fuse.AlluxioFuseFileSystemTest.before(AlluxioFuseFileSystemTest.java:75)

write(alluxio.fuse.AlluxioFuseFileSystemTest) Time elapsed: 0.005 sec <<< ERROR!
java.lang.UnsatisfiedLinkError: dlopen(libfuse.dylib, 9): image not found
at alluxio.fuse.AlluxioFuseFileSystemTest.before(AlluxioFuseFileSystemTest.java:75)

pathTranslation(alluxio.fuse.AlluxioFuseFileSystemTest) Time elapsed: 0.005 sec <<< ERROR!
java.lang.UnsatisfiedLinkError: dlopen(libfuse.dylib, 9): image not found
at alluxio.fuse.AlluxioFuseFileSystemTest.before(AlluxioFuseFileSystemTest.java:75)

renameNewExist(alluxio.fuse.AlluxioFuseFileSystemTest) Time elapsed: 0.003 sec <<< ERROR!
java.lang.UnsatisfiedLinkError: dlopen(libfuse.dylib, 9): image not found
at alluxio.fuse.AlluxioFuseFileSystemTest.before(AlluxioFuseFileSystemTest.java:75)

Results :

Tests in error:
AlluxioFuseFileSystemTest.before:75 » UnsatisfiedLink dlopen(libfuse.dylib, 9)...
AlluxioFuseFileSystemTest.before:75 » UnsatisfiedLink dlopen(libfuse.dylib, 9)...
AlluxioFuseFileSystemTest.before:75 » UnsatisfiedLink dlopen(libfuse.dylib, 9)...
AlluxioFuseFileSystemTest.before:75 » UnsatisfiedLink dlopen(libfuse.dylib, 9)...
AlluxioFuseFileSystemTest.before:75 » UnsatisfiedLink dlopen(libfuse.dylib, 9)...
AlluxioFuseFileSystemTest.before:75 » UnsatisfiedLink dlopen(libfuse.dylib, 9)...
AlluxioFuseFileSystemTest.before:75 » UnsatisfiedLink dlopen(libfuse.dylib, 9)...
AlluxioFuseFileSystemTest.before:75 » UnsatisfiedLink dlopen(libfuse.dylib, 9)...
AlluxioFuseFileSystemTest.before:75 » UnsatisfiedLink dlopen(libfuse.dylib, 9)...
AlluxioFuseFileSystemTest.before:75 » UnsatisfiedLink dlopen(libfuse.dylib, 9)...
AlluxioFuseFileSystemTest.before:75 » UnsatisfiedLink dlopen(libfuse.dylib, 9)...
AlluxioFuseFileSystemTest.before:75 » UnsatisfiedLink dlopen(libfuse.dylib, 9)...
AlluxioFuseFileSystemTest.before:75 » UnsatisfiedLink dlopen(libfuse.dylib, 9)...

Tests run: 13, Failures: 0, Errors: 13, Skipped: 0

[INFO] ------------------------------------------------------------------------
[INFO] Reactor Summary:
[INFO]
[INFO] Alluxio Parent ..................................... SUCCESS [ 6.570 s]
[INFO] Alluxio Core ....................................... SUCCESS [ 2.235 s]
[INFO] Alluxio Core - Protobuf ............................ SUCCESS [ 27.317 s]
[INFO] Alluxio Core - Common Utilities .................... SUCCESS [02:15 min]
[INFO] Alluxio Core - Client .............................. SUCCESS [ 0.866 s]
[INFO] Alluxio Core - Client - File System ................ SUCCESS [01:08 min]
[INFO] Alluxio Key Value .................................. SUCCESS [ 0.903 s]
[INFO] Alluxio Key Value - Common Utilities ............... SUCCESS [ 20.282 s]
[INFO] Alluxio Key Value - Client ......................... SUCCESS [ 10.669 s]
[INFO] Alluxio Key Value - Hadoop Utilities ............... SUCCESS [ 8.330 s]
[INFO] Alluxio Examples ................................... SUCCESS [ 10.271 s]
[INFO] Alluxio Shell ...................................... SUCCESS [ 11.845 s]
[INFO] Alluxio Assembly JARs .............................. SUCCESS [ 0.849 s]
[INFO] Alluxio Assembly - Client .......................... SUCCESS [ 4.999 s]
[INFO] Alluxio Core - Server .............................. SUCCESS [ 1.494 s]
[INFO] Alluxio Core - Server - Common Utilities ........... SUCCESS [ 18.491 s]
[INFO] Alluxio Under File System .......................... SUCCESS [ 0.681 s]
[INFO] Alluxio Under File System - Local FS ............... SUCCESS [ 7.636 s]
[INFO] Alluxio Core - Server - Master ..................... SUCCESS [01:10 min]
[INFO] Alluxio Core - Server - Proxy ...................... SUCCESS [ 11.616 s]
[INFO] Alluxio Core - Server - Worker ..................... SUCCESS [01:03 min]
[INFO] Alluxio Key Value - Server ......................... SUCCESS [ 7.504 s]
[INFO] Alluxio Log Server ................................. SUCCESS [ 5.196 s]
[INFO] Alluxio Assembly - Server .......................... SUCCESS [ 3.557 s]
[INFO] Alluxio Core - Client - HDFS ....................... SUCCESS [ 15.755 s]
[INFO] Alluxio Core - Client - Runtime .................... SUCCESS [ 10.598 s]
[INFO] Alluxio Integration ................................ SUCCESS [ 0.752 s]
[INFO] Alluxio Integration - FUSE ......................... FAILURE [ 7.006 s]
[INFO] Alluxio MiniCluster ................................ SKIPPED
[INFO] Alluxio Tests ...................................... SKIPPED
[INFO] Alluxio Under File System - GCS .................... SKIPPED
[INFO] Alluxio Under File System - HDFS ................... SKIPPED
[INFO] Alluxio Under File System - Aliyun OSS ............. SKIPPED
[INFO] Alluxio Under File System - S3A .................... SKIPPED
[INFO] Alluxio Under File System - Swift .................. SKIPPED
[INFO] Alluxio Under File System - Microsoft Azure Blob Storage SKIPPED
[INFO] ------------------------------------------------------------------------
[INFO] BUILD FAILURE
[INFO] ------------------------------------------------------------------------
[INFO] Total time: 08:54 min
[INFO] Finished at: 2017-11-23T01:02:14-05:00
[INFO] Final Memory: 134M/956M
[INFO] ------------------------------------------------------------------------
[ERROR] Failed to execute goal org.apache.maven.plugins:maven-surefire-plugin:2.19.1:test (default-test) on project alluxio-integration-fuse: There are test failures.
[ERROR]
[ERROR] Please refer to /Users/gurmeetb/Desktop/alluxio/integration/fuse/target/surefire-reports for the individual test results.
[ERROR] -> [Help 1]
[ERROR]
[ERROR] To see the full stack trace of the errors, re-run Maven with the -e switch.
[ERROR] Re-run Maven using the -X switch to enable full debug logging.
[ERROR]
[ERROR] For more information about the errors and possible solutions, please read the following articles:
[ERROR] [Help 1] http://cwiki.apache.org/confluence/display/MAVEN/MojoFailureException
[ERROR]
[ERROR] After correcting the problems, you can resume the build with the command
[ERROR] mvn <goals> -rf :alluxio-integration-fuse
Gurmeets-MBP:alluxio gurmeetb$

Environment

None

Activity

Show:
Gurmeet Budhraja
November 23, 2017, 5:41 PM

Missing package dependency found on libfuse.dylib in Mac OS X High Sierra. Should this be documented in setup guide?

Yupeng Fu
November 28, 2017, 5:58 AM

Thanks for checking it out.
Recently we had a PR to improve the docs for this error: https://github.com/Alluxio/alluxio/pull/6508

You need to install osxfuse to run the fuse tests. Alternatively, you can skip the tests by using the option -DskipTests in your maven build command.

Assignee

Unassigned

Reporter

Gurmeet Budhraja

Labels

None

Affects versions

Priority

Trivial